Systematiken für den Präsenzbestand an der Herzog August Bibliothek
type: Concept

Altertumswissenschaften
type: Concept
broader: Systematiken für den Präsenzbestand an der Herzog August Bibliothek
notation: Altertumswissenschaften @https
notation: contributor
notation: Christian Heitzmann
date: 2025-05-04 @xsd
date: date
description: Präsenzbestand für das Fach Altertumswissenschaften. Standort: Zeughaus, Erdgeschoss
preferred label: Allgemeines zum gesamten Fach
notation: AL 01 @https
notation: broader
notation: type
notation: Concept
preferred label: Enzyklopädien, Sachwörterbücher
notation: AL 01-0100_0299 @https
preferred label: Sprach- und terminologische Wörterbücher
notation: AL 01-0300_0499 @https
preferred label: Biographische Wörterbücher
notation: AL 01-0500_0599 @https
preferred label: Geschichte und Methodik, Forschungsberichte
notation: AL 01-0600_0799 @https
preferred label: Handbücher
notation: AL 01-0800_0999 @https
preferred label: Wirkungsgeschichte
notation: AL 01-1000_1999 @https
preferred label: Vor- und Frühgeschichte
notation: AL 02 @https
preferred label: Allgemeines
notation: AL 02-0100_0199 @https
preferred label: Kataloge (Museen, Ausstellungen)
notation: AL 02-0200_0299 @https
notation: AL 02-0300_0399 @https
notation: AL 02-0400_0499 @https
preferred label: Bildmaterial, Tafeln, Tabellen, Statistiken
notation: AL 02-0500_0599 @https
preferred label: Geschichte und Methodik der Wissenschaft, Forschungsberichte, Kongressberichte
notation: AL 02-0600_0699 @https
preferred label: Naturwissenschaftlich-technische Forschungsmethoden und Hilfsmittel
notation: AL 02-0700_0749 @https
preferred label: Organisationsformen, Fachadreßbücher, Beruf
notation: AL 02-0750_0799 @https
preferred label: Denkmalschutz, Ausgrabungsrecht
notation: AL 02-0800_0849 @https
preferred label: Meeresarchäologie
notation: AL 02-0850_0899 @https
preferred label: Chronologie
notation: AL 02-0900_0999 @https
preferred label: Gesammelte Abhandlungen mehrerer (Festschriften) und einzelner Schriftenreihen
notation: AL 02-1000_1499 @https
preferred label: Einführungen
notation: AL 02-1500_1599 @https
preferred label: Handbücher, allgemeine Darstellungen
notation: AL 02-1600_1699 @https
preferred label: Einzelprobleme
notation: AL 02-1700_1999 @https
preferred label: Einzelne Länder
notation: AL 02-2000_2009 @https
preferred label: Europa
notation: AL 02-2010_2499 @https
preferred label: Gesamtdarstellungen
notation: AL 02-2020_2049 @https
preferred label: Europäische Regionen
notation: AL 02-2050_2099 @https
preferred label: Untersuchungen zu Einzelfragen
notation: AL 02-2100_2199 @https
preferred label: Abhandlungen zur Kulturgeschichte
notation: AL 02-2200_2249 @https
preferred label: Regionen
notation: AL 02-2250_2498 @https
preferred label: Wirtschaft, Handel, Verkehr, Handwerk
notation: AL 02-2250_2299 @https
preferred label: Einzelne Epochen
notation: AL 02-2300_2309 @https
preferred label: Steinzeit (–1800 v. Chr.)
notation: AL 02-2310_2349 @https
preferred label: Bronze- und Urnenfelderzeit (–750 v. Chr.)
notation: AL 02-2350_2399 @https
preferred label: Hallstattzeit (–500 v. Chr.)
notation: AL 02-2400_2449 @https