Systematiken für den Präsenzbestand an der Herzog August Bibliothek
type: Concept

Anglistik
type: Concept
broader: Systematiken für den Präsenzbestand an der Herzog August Bibliothek
notation: Anglistik @https
notation: contributor
notation: Elizabeth Harding
date: 2025-04-14 @xsd
date: date
description: Präsenzbestand für das Fach Anglistik. Standort: Zeughaus, Erdgeschoss und Galerie im Erdgeschoss
preferred label: Anglistik allgemeines
notation: AN 01 @https
notation: broader
notation: type
notation: Concept
preferred label: Lexika, Sachwörterbücher
notation: AN 01-0001_0099 @https
preferred label: Handbücher, Grundrisse
notation: AN 01-0100_0149 @https
preferred label: Einführungen
notation: AN 01-0150_0199 @https
preferred label: Darstellungen
notation: AN 01-0200_0349 @https
preferred label: Forschungsberichte
notation: AN 01-0350_0399 @https
preferred label: Tafeln, Tabellen, Bildmaterialien
notation: AN 01-0400_0449 @https
preferred label: Fachadreßbücher
notation: AN 01-0450_0499 @https
preferred label: Gesammelte Abhandlungen Einzelner
notation: AN 01-0500_0649 @https
preferred label: Gesammelte Abhandlungen Mehrerer
notation: AN 01-0650_0799 @https
preferred label: Schriftenreihen
notation: AN 01-0800_0849 @https
preferred label: Gesellschaften, Vereinigungen
notation: AN 01-0850_0899 @https
preferred label: Institute
notation: AN 01-0900_0949 @https
preferred label: Kongresse
notation: AN 01-0950_0999 @https
preferred label: Geschichte der Anglistik
notation: AN 02 @https
preferred label: Quellensammlungen
notation: AN 02-0001_0199 @https
preferred label: Gesamtdarstellungen
notation: AN 02-0200_0399 @https
preferred label: Tabellenwerke, Bildmaterialien
notation: AN 02-0400_0499 @https
preferred label: Geschichte der Wissenschaft in und von einzelnen Epochen
notation: AN 02-0500_1899 @https
preferred label: Mittelalter
notation: AN 02-0500_0699 @https
preferred label: Renaissance, Humanismus (16. Jahrhundert)
notation: AN 02-0700_0899 @https
preferred label: 17. Jahrhundert
notation: AN 02-0900_1099 @https
preferred label: 18. Jahrhundert
notation: AN 02-1100_1299 @https
preferred label: 19. Jahrhundert
notation: AN 02-1300_1499 @https
preferred label: 20. Jahrhundert
notation: AN 02-1500_1899 @https
preferred label: Einzelne Anglisten (A–Z) Festschriften
notation: AN 02-1900_4500 @https
preferred label: Englische Sprachwissenschaft
notation: AN 03 @https
preferred label: Allgemeines (Schlüssel : s. 01)
notation: AN 03-0001_0999 @https
preferred label: Grammatik
notation: AN 03-1000_1999 @https
preferred label: Phonetik, Phonologie
notation: AN 03-2000_2499 @https
preferred label: Morphologie
notation: AN 03-2500_2999 @https
preferred label: Syntax
notation: AN 03-3000_3499 @https
preferred label: Wortbildung
notation: AN 03-3500_3999 @https
preferred label: Wortschatz
notation: AN 03-4000_4499 @https