Systematiken für den Präsenzbestand an der Herzog August Bibliothek
type: Concept

Buch- und Bibliothekswesen
type: Concept
broader: Systematiken für den Präsenzbestand an der Herzog August Bibliothek
notation: Buch- und Bibliothekswesen @https
notation: contributor
notation: Sandra Simon
date: 2025-04-14 @xsd
date: date
description: Präsenzbestand für das Fach Buch- und Bibliothekswesen. Standort: Zeughaus, 1. Obergeschoss
preferred label: Information und Kommunikation
notation: BB 01 @https
notation: broader
notation: type
notation: Concept
preferred label: Öffentlichkeit und Autor
notation: BB 02 @https
preferred label: Buchwesen allgemein. Buch­ und Bibliothekswesen allgemein
notation: BB 05 @https
preferred label: Quellen
notation: BB 05-0001_0299 @https
preferred label: Wörterbücher
notation: BB 05-0300_0599 @https
preferred label: Lexika
notation: BB 05-0600_0899 @https
preferred label: Handbücher
notation: BB 05-0900_0999 @https
preferred label: Darstellungen
notation: BB 05-1000_2999 @https
preferred label: Gesammelte Schriften eines Autors
notation: BB 05-3000_5999 @https
preferred label: Sammelschriften, Festschriften, Gedenkschriften
notation: BB 05-6000_8999 @https
preferred label: Anthologien
notation: BB 05-9000_9149 @https
preferred label: Schriftenreihen
notation: BB 05-9150_9249 @https
preferred label: Gesellschaften, Vereine
notation: BB 05-9250_9499 @https
preferred label: Institute, Schulen Museen
notation: BB 05-9500_9799 @https
preferred label: Kongresse
notation: BB 05-9800_9999 @https
preferred label: Geschichte des Buchdrucks [I]
notation: BB 07 @https
preferred label: Geschichte des Buchdrucks allgemein
notation: BB 07-0001_1999 @https
preferred label: Vorstufen, Xylographica
notation: BB 07-2000_2999 @https
preferred label: Erfindung des Buchdrucks, Gutenbergforschung
notation: BB 07-3000_4999 @https
preferred label: Inkunabelkunde
notation: BB 07-5000_6999 @https
preferred label: Der Frühdruck nach Orten
notation: BB 07-7000_9999 @https
preferred label: Geschichte des Buchdrucks [II]
notation: BB 08 @https
preferred label: Der Frühdruck nach Regionen
notation: BB 08-0001_1499 @https
preferred label: Der Frühdruck in Deutschland
notation: BB 08-1500_1624 @https
preferred label: Österreich, Schweiz, Liechtenstein
notation: BB 08-1625_1749 @https
preferred label: Großbritannien, Irland
notation: BB 08-1750_1999 @https
preferred label: Frankreich
notation: BB 08-2000_2249 @https
preferred label: Italien
notation: BB 08-2250_2499 @https
preferred label: Spanien, Portugal
notation: BB 08-2500_2749 @https
preferred label: Niederlande, Belgien, Luxemburg
notation: BB 08-2750_2999 @https
preferred label: Dänemark, Schweden, Norwegen, Island, Finnland
notation: BB 08-3000_3249 @https
preferred label: Polen, Tschechoslowakei, Ungarn
notation: BB 08-3250_3499 @https
preferred label: Jugoslawien, Bulgarien, Rumänien, Albanien, Griechenland
notation: BB 08-3500_3749 @https
preferred label: Sowjetunion
notation: BB 08-3750_3999 @https