Systematiken für den Präsenzbestand an der Herzog August Bibliothek
type: Concept

Germanische Sprachen und Literaturen
type: Concept
broader: Systematiken für den Präsenzbestand an der Herzog August Bibliothek
notation: Germanische Sprachen und Literaturen @https
notation: contributor
notation: Sandra Simon
date: 2025-10-23 @xsd
date: date
description: Präsenzbestand für das Fach Germanische Sprachen und Literaturen. Standort: Zeughaus, 1. Obergeschoss
preferred label: Germanistik: allgemein
notation: GE 01 @https
notation: broader
notation: type
notation: Concept
preferred label: Lexika
notation: GE 01-1000_1049 @https
preferred label: Handbücher
notation: GE 01-1050_1099 @https
preferred label: Einführungen
notation: GE 01-1100_1149 @https
preferred label: Darstellungen
notation: GE 01-1150_1199 @https
preferred label: Forschungsberichte
notation: GE 01-1200_1299 @https
preferred label: Tabellen, Statistiken
notation: GE 01-1300_1349 @https
preferred label: Fachadreßbücher
notation: GE 01-1350_1399 @https
preferred label: Schriftenreihen
notation: GE 01-1600_1699 @https
preferred label: Gesellschaften und Vereine
notation: GE 01-1700_1799 @https
preferred label: Institute
notation: GE 01-1800_1899 @https
preferred label: Kongresse
notation: GE 01-1900_1999 @https
preferred label: Geschichte der Germanistik
notation: GE 02 @https
preferred label: Quellensammlungen
notation: GE 02-1000_1099 @https
preferred label: Gesamtdarstellungen
notation: GE 02-1100_1199 @https
preferred label: Tabellenwerke, Bildmaterialien
notation: GE 02-1200_1299 @https
preferred label: Mittelalter
notation: GE 02-1300_1349 @https
preferred label: Renaissance und Humanismus
notation: GE 02-1350_1399 @https
preferred label: 16. Jahrhundert
notation: GE 02-1400_1449 @https
preferred label: 17. Jahrhundert
notation: GE 02-1450_1499 @https
preferred label: 18. Jahrhundert
notation: GE 02-1500_1549 @https
preferred label: 19. Jahrhundert
notation: GE 02-1550_1599 @https
preferred label: 20. Jahrhundert
notation: GE 02-1600_1799 @https
preferred label: Einzelne Germanisten
notation: GE 03 @https
preferred label: Gesammelte Abhandlungen
notation: GE 03-0000_3999 @https
preferred label: A
notation: GE 03-0001_0199 @https
preferred label: B
notation: GE 03-0200_0399 @https
preferred label: C
notation: GE 03-0400_0599 @https
preferred label: D
notation: GE 03-0600_0799 @https
preferred label: E
notation: GE 03-0800_0999 @https
preferred label: F
notation: GE 03-1000_1199 @https
preferred label: G
notation: GE 03-1200_1399 @https
preferred label: H
notation: GE 03-1400_1599 @https
preferred label: I
notation: GE 03-1600_1799 @https