Systematiken für den Präsenzbestand an der Herzog August Bibliothek
type: Concept

Geographie und Kartographie
type: Concept
broader: Systematiken für den Präsenzbestand an der Herzog August Bibliothek
notation: Geographie und Kartographie @https
notation: contributor
notation: Sandra Simon
date: 2026-05-05 @xsd
date: date
description: Präsenzbestand für das Fach Geographie und Kartographie. Standort: Zeughaus, Erdgeschoss
preferred label: Geographie und Kartographie insgesamt (Formalschlüssel : 10.000)
notation: GK#01 @https
notation: broader
notation: type
notation: Concept
preferred label: Geographie
notation: GK#02 @https
preferred label: Allgemeines (Formalschlüssel : 6000)
notation: GK#02-0001_5999 @https
preferred label: Geschichte der Geographie
notation: GK#04 @https
preferred label: Allgemeines (Formalschlüssel : 2000)
notation: GK#04-0001_1999 @https
preferred label: Einzelne Probleme
notation: GK#04-2000_2999 @https
preferred label: Geschichte der Geographie in einzelnen Epochen
notation: GK#04-3000_9499 @https
preferred label: Altertum
notation: GK#04-3000_3999 @https
preferred label: Mittelalter
notation: GK#04-4000_4999 @https
preferred label: 15. Jahrhundert
notation: GK#04-5000_5499 @https
preferred label: 16. Jahrhundert
notation: GK#04-5500_6499 @https
preferred label: 17. Jahrhundert
notation: GK#04-6500_6999 @https
preferred label: 18. Jahrhundert
notation: GK#04-7000_7499 @https
preferred label: 19. Jahrhundert
notation: GK#04-7500_8499 @https
preferred label: 20. Jahrhundert
notation: GK#04-8500_9499 @https
preferred label: Einzelne Geographen (A–Z)
notation: GK#05 @https
preferred label: Länder­ und Ortslexika
notation: GK#06 @https
preferred label: Länderlexika
notation: GK#06-0001_1999 @https
preferred label: Ortslexika: Welt
notation: GK#06-2000_4999 @https
preferred label: Ortslexika einzelner Länder (Länderschlüssel)
notation: GK#07 @https
preferred label: Europa
notation: GK#07-0000_1999 @https
preferred label: Osteuropa i. G.
notation: GK#07-0001_1999 @https
preferred label: Deutschland
notation: GK#07-2000_4999 @https
preferred label: Polen
notation: GK#07-2000_2199 @https
preferred label: Tschechoslowakei
notation: GK#07-2200_2399 @https
preferred label: Ungarn
notation: GK#07-2400_2599 @https
preferred label: Jugoslawien
notation: GK#07-2600_2699 @https
preferred label: Jugoslawien: einzelne Teilrepubliken
notation: GK#07-2700_2799 @https
preferred label: Bulgarien
notation: GK#07-3000_3499 @https
preferred label: Rumänien
notation: GK#07-3500_3699 @https
preferred label: Albanien
notation: GK#07-3700_3799 @https
preferred label: Griechenland
notation: GK#07-3800_4299 @https
preferred label: Sowjetunion
notation: GK#07-4300_4599 @https
preferred label: Sowjetunion: einzelne Unionsrepubliken
notation: GK#07-4600_4799 @https