Systematiken für den Präsenzbestand an der Herzog August Bibliothek
type: Concept

Geschichte
type: Concept
broader: Systematiken für den Präsenzbestand an der Herzog August Bibliothek
notation: Geschichte @https
notation: contributor
notation: Volker Bauer
date: 2026-05-05 @xsd
date: date
description: Präsenzbestand für das Fach Geschichte. Standort: Zeughaus, Erdgeschoss
preferred label: Allgemeines
notation: GS#01 @https
notation: broader
notation: type
notation: Concept
preferred label: Einführungen in die Geschichtswissenschaft
notation: GS#01-1000_1099 @https
preferred label: Allgemeine Einführungen
notation: GS#01-1100_1199 @https
preferred label: Mittelalterliche und Neuere Geschichte
notation: GS#01-1200_1999 @https
preferred label: Quellenkunden
notation: GS#01-2000_2009 @https
preferred label: Allgemeine Quellenkunden
notation: GS#01-2010_2099 @https
preferred label: Quellenkunde zur Mittelalterlichen und Neueren Geschichte
notation: GS#01-2100_2109 @https
preferred label: Gesamtgebiet
notation: GS#01-2110_2149 @https
preferred label: Mittelalter
notation: GS#01-2150_2249 @https
preferred label: Neuzeit
notation: GS#01-2250_2399 @https
preferred label: Regionale Quellenkunden
notation: GS#01-2400_2599 @https
preferred label: Quellenkunden zu Spezialgebieten
notation: GS#01-2600_2899 @https
preferred label: Enzyklopädien, Sachwörterbücher
notation: GS#01-2900_3099 @https
preferred label: Nachschlagewerke zur gesamten Geschichte und Universalgeschichte (Allgemeine Nachschlagewerke zur Mittelalterlichen und Neueren Geschichte)
notation: GS#01-3100_3199 @https
preferred label: Deutschland
notation: GS#01-3200_3299 @https
preferred label: Andere Staaten (nach Länderschlüssel geordnet)
notation: GS#01-3300_3799 @https
preferred label: Nachschlagewerke zu historischen Zweigwissenschaften
notation: GS#01-3800_3999 @https
preferred label: Sprachwörterbücher, Terminologische Wörterbücher
notation: GS#01-4000_4199 @https
preferred label: Geographische Wörterbücher
notation: GS#01-4200_4299 @https
preferred label: Biographische Lexika
notation: GS#01-4300_5999 @https
preferred label: Tafeln, Atlanten, Karten
notation: GS#01-6000_6009 @https
preferred label: Zeittafeln, Regententafeln
notation: GS#01-6010_6199 @https
preferred label: Allgemeine historische Atlanten
notation: GS#01-6200_6399 @https
preferred label: Atlanten zu Spezialgebieten
notation: GS#01-6400_6999 @https
preferred label: Geschichtstheorie, Geschichte der Geschichtsschreibung, Forschungsberichte, Organisationsformen
notation: GS#01-7000_7599 @https
preferred label: Mittelalter, Renaissance und Humanismus
notation: GS#01-7600_7649 @https
preferred label: Reformation und Gegenreformation
notation: GS#01-7650_7699 @https
preferred label: Barock (17. Jahrhundert)
notation: GS#01-7700_7749 @https
preferred label: Aufklärung (18. Jahrhundert)
notation: GS#01-7750_7799 @https
preferred label: Moderne Historiographie (19. und 20. Jahrhundert)
notation: GS#01-7800_7849 @https
preferred label: Biographien, Autobiographien, Briefe (A–Z)
notation: GS#01-7850_7949 @https
preferred label: Forschungsberichte, Geschichte hist. Institutionen
notation: GS#01-7950_7999 @https
preferred label: Gesammelte Abhandlungen mehrerer (Festschriften) und einzelner (A–Z) Schriftenreihen
notation: GS#01-8000_8999 @https
preferred label: Historische Hilfswissenschaften (Einführungen, Gesamtdarstellungen, Allgemeines)
notation: GS#02 @https