Systematiken für den Präsenzbestand an der Herzog August Bibliothek
type: Concept

Handbibliothek des Handschriftenlesesaals
type: Concept
broader: Systematiken für den Präsenzbestand an der Herzog August Bibliothek
notation: Handbibliothek des Handschriftenlesesaals @https
notation: contributor
notation: Christian Heitzmann
date: 2025-04-14 @xsd
date: date
description: Präsenzbestand für das Fach Handbibliothek des Handschriftenlesesaals. Standort: Augusta
preferred label: Allgemeine Nachschlagewerke
notation: HS 01 @https
notation: broader
notation: type
notation: Concept
preferred label: Handbibliotheken in Handschriftenabt.
notation: HS 01-0001_0999 @https
preferred label: Konversationslexika, Biographische Nachschlagewerke
notation: HS 01-1000_1999 @https
preferred label: Stammtafeln, Regententabellen
notation: HS 01-2000_3999 @https
preferred label: Weltgeschichte
notation: HS 01-4000_9999 @https
preferred label: Wörterbücher
notation: HS 02 @https
preferred label: Griechisch und Lateinisch
notation: HS 02-0001_0999 @https
preferred label: Deutsch
notation: HS 02-1000_1499 @https
preferred label: andere Sprachen
notation: HS 02-1500_1999 @https
preferred label: Nachschlagewerke zu Geschichte u. Literatur
notation: HS 02-2000_9999 @https
preferred label: Lexika (Enzyklopädien) und Repertorien
notation: HS 02-2000_2099 @https
preferred label: Antike allg.
notation: HS 02-2100_2199 @https
preferred label: Mittelalter allg.
notation: HS 02-2200_2299 @https
preferred label: Literaturwissenschaft
notation: HS 02-2300_2399 @https
preferred label: Autoren
notation: HS 02-2400_2599 @https
preferred label: Kunst
notation: HS 02-2600_2699 @https
preferred label: Maria
notation: HS 02-2700_2974 @https
preferred label: Buchgeschichte
notation: HS 02-2975_4999 @https
preferred label: Kirchen- und Ordensgeschichte
notation: HS 02-5000_9999 @https
preferred label: Nachschlagewerke zu Initien, Kolophonen und Schreibervermerken
notation: HS 03 @https
preferred label: Initienverzeichnisse
notation: HS 03-0001_4999 @https
preferred label: Kolophone, Schreibervermerke
notation: HS 03-5000_9999 @https
preferred label: Historische Hilfswissenschaften
notation: HS 04 @https
preferred label: Allgemein
notation: HS 04-0001_0199 @https
preferred label: Chronologie
notation: HS 04-0200_0999 @https
preferred label: Diplomatik
notation: HS 04-1000_1999 @https
preferred label: Epigraphik
notation: HS 04-2000_2999 @https
preferred label: Aktenkunde
notation: HS 04-3000_4999 @https
preferred label: Beschreibstoffe
notation: HS 04-5000_9999 @https
notation: HS 04-5000_5999 @https
preferred label: Papyrologie
notation: HS 04-6000_6999 @https
preferred label: Pergament
notation: HS 04-7000_7599 @https
preferred label: Palimpseste
notation: HS 04-7600_7999 @https
preferred label: Papier und Wasserzeichenkunde
notation: HS 04-8000_8999 @https
preferred label: Findbücher für Wasserzeichen