Systematiken für den Präsenzbestand an der Herzog August Bibliothek
type: Concept

Allgemeine Bibliographien, Fachbibliographien, allgemeine Nachschlagewerke
type: Concept
broader: Systematiken für den Präsenzbestand an der Herzog August Bibliothek
notation: Allgemeine Bibliographien, Fachbibliographien, allgemeine Nachschlagewerke @https
notation: contributor
notation: Henrietta Danker
date: 2025-04-14 @xsd
date: date
description: Präsenzbestand für das Fach Allgemeine Bibliographien, Fachbibliographien, allgemeine Nachschlagewerke. Standort: Zeughaus, Erdgeschoss
preferred label: Inkunabelbibliographien
notation: KA 01 @https
notation: broader
notation: type
notation: Concept
preferred label: Internationale Bibliographien
notation: KA 01-0001_0499 @https
preferred label: Inkunabelkataloge einzelner Bibliotheken (Länderschlüssel / Einzelne Orte)
notation: KA 01-0500_4999 @https
preferred label: Nationale Bibliographien, einzelne Druckorte (Länderschlüssel / Einzelne Orte)
notation: KA 01-5000_8999 @https
preferred label: Inkunabelbibliographien zu einzelnen Fachgebieten
notation: KA 01-9000_9999 @https
preferred label: Internationale allgemeine Bibliographien
notation: KA 02 @https
preferred label: Bibliographien der Bibliographien und allgemeinen Nachschlagewerke
notation: KA 02-0001_0999 @https
preferred label: Drucke des 16. Jahrhunderts
notation: KA 02-1000_1999 @https
preferred label: Drucke des 17. und 18. Jahrhunderts
notation: KA 02-2000_2999 @https
preferred label: Bibliographien mit umfassender Berichtszeit
notation: KA 02-3000_4999 @https
preferred label: Buchhandelsverzeichnisse
notation: KA 02-5000_5199 @https
preferred label: Nachdrucke, Mikroformen
notation: KA 02-5200_5399 @https
preferred label: Auswahlbibliographien, Verzeichnisse wissenschaftlicher Bücher
notation: KA 02-5400_5899 @https
preferred label: Verbotene und unerwünschte Literatur
notation: KA 02-5900_5999 @https
preferred label: Rara, Erotica, Curiosa
notation: KA 02-6000_6499 @https
preferred label: Hochschulschriften
notation: KA 02-7000_7499 @https
preferred label: Schriften der Akademien, wissenschaftlichen Gesellschaften und Forschungsstätten
notation: KA 02-7500_7999 @https
preferred label: Amtliche Druckschriften. Veröffentlichungen der internationalen Organisationen (UN, UNESCO und Untergliederungen)
notation: KA 02-8000_8999 @https
preferred label: Veröffentlichungen ethnischer, sozialer, religiöser Gruppen
notation: KA 02-9000_9999 @https
preferred label: Allgemeine Bibliotheks- und Gesamtkataloge
notation: KA 03 @https
preferred label: Deutschland
notation: KA 03-0001_2399 @https
preferred label: Österreich
notation: KA 03-2400_2699 @https
preferred label: Schweiz
notation: KA 03-2700_2999 @https
preferred label: Großbritannien
notation: KA 03-3000_3599 @https
preferred label: Irland
notation: KA 03-3600_3749 @https
preferred label: Frankreich
notation: KA 03-3750_4499 @https
preferred label: Italien
notation: KA 03-4500_5249 @https
preferred label: Spanien
notation: KA 03-5250_5624 @https
preferred label: Portugal
notation: KA 03-5625_5999 @https
preferred label: Niederlande
notation: KA 03-6000_6749 @https
preferred label: Belgien
notation: KA 03-6750_7124 @https
preferred label: Luxemburg
notation: KA 03-7125_7499 @https
preferred label: Dänemark
notation: KA 03-7500_8099 @https
preferred label: Schweden
notation: KA 03-8100_8549 @https