Systematiken für den Präsenzbestand an der Herzog August Bibliothek
type: Concept

Kunst
type: Concept
broader: Systematiken für den Präsenzbestand an der Herzog August Bibliothek
notation: Kunst
notation: contributor
notation: Hole Rößler @de
date: 2025-04-14 @xsd
date: date
description: Präsenzbestand für das Fach Kunst. Standort: Zeughaus, 2. Obergeschoss @de
preferred label: Kunstwissenschaft im allgemeinen @de
notation: KS 01
notation: broader
notation: type
notation: Concept
preferred label: Quellensammlungen @de
notation: KS 01-0001_0499
preferred label: Lexika @de
notation: KS 01-0500_0999
preferred label: Handbücher @de
notation: KS 01-1000_1499
preferred label: Einführungen, Darstellungen usw. @de
notation: KS 01-1500_2700
preferred label: Geschichte der Kunstwissenschaft @de
notation: KS 02
notation: KS 02-0001_0499
notation: KS 02-0500_0999
notation: KS 02-1000_1499
notation: KS 02-1500_2700
preferred label: Einzelne Kunstwissenschaftler @de
notation: KS 03
preferred label: Gesammelte Abhandlungen @de
notation: KS 03-0001_3999
preferred label: Festschriften @de
notation: KS 03-4000_7999
preferred label: Biographisches @de
notation: KS 03-8000_9999
preferred label: Methodik der Kunstwissenschaft @de
notation: KS 04
notation: KS 04-0001_0499
notation: KS 04-0500_0999
notation: KS 04-1000_1499
notation: KS 04-1500_2700
preferred label: Kunstphilosophie @de
notation: KS 05
notation: KS 05-0001_0499
notation: KS 05-0500_0999
notation: KS 05-1000_1499
notation: KS 05-1500_2700
preferred label: Kunstästhetik @de
notation: KS 06
notation: KS 06-0001_0499
notation: KS 06-0500_0999
notation: KS 06-1000_1499
notation: KS 06-1500_2700
preferred label: Kunsttheorie @de
notation: KS 07
notation: KS 07-0001_0499
notation: KS 07-0500_0999
notation: KS 07-1000_1499
notation: KS 07-1500_2700
preferred label: Sonderfragen @de
notation: KS 07-6500_7499
preferred label: Perspektive @de
notation: KS 07-7500_7999
preferred label: Wechselbeziehungen @de
notation: KS 07-8000_8499
preferred label: Kunstkritik @de
notation: KS 08
notation: KS 08-0001_0499
notation: KS 08-0500_0999
notation: KS 08-1000_1499
notation: KS 08-1500_2700
preferred label: Kunstpsychologie @de
notation: KS 09
notation: KS 09-0001_0499
notation: KS 09-0500_0999
notation: KS 09-1000_1499
notation: KS 09-1500_2700
preferred label: Kunstsoziologie @de
notation: KS 10