Systematiken für den Präsenzbestand an der Herzog August Bibliothek
type: Concept

Allgemeine Sprach- und Literaturwissenschaft
type: Concept
broader: Systematiken für den Präsenzbestand an der Herzog August Bibliothek
notation: Allgemeine Sprach- und Literaturwissenschaft
notation: contributor
notation: Sandra Simon @de
date: 2025-04-14 @xsd
date: date
description: Präsenzbestand für das Fach Allgemeine Sprach- und Literaturwissenschaft. Standort: Zeughaus, 1. Obergeschoss @de
preferred label: Sprach- und Literaturwissenschaft insgesamt (Formalschlüssel: 10.000) @de
notation: LI 01
notation: broader
notation: type
notation: Concept
preferred label: Allgemeine und vergleichende Sprachwissenschaft @de
notation: LI 02
preferred label: Allgemeines (Formalschlüssel: 10.000) @de
notation: LI 02-0001_9999
preferred label: Geschichte der Sprachwissenschaft @de
notation: LI 04
preferred label: Quellensammlungen @de
notation: LI 04-0001_0999
preferred label: Allgemeines (Formalschlüssel: 2000) @de
notation: LI 04-1000_2999
preferred label: Einzelne Probleme @de
notation: LI 04-3000_3499
preferred label: Einzelne Epochen @de
notation: LI 04-3500_9499
preferred label: Altertum @de
notation: LI 04-3500_4499
preferred label: Mittelalter @de
notation: LI 04-4500_5499
preferred label: Renaissance, Humanismus @de
notation: LI 04-5500_6400
preferred label: 17. Jahrhundert @de
notation: LI 04-6500_6999
preferred label: 18. Jahrhundert @de
notation: LI 04-7000_7499
preferred label: 19. Jahrhundert @de
notation: LI 04-7500_8499
preferred label: 20. Jahrhundert @de
notation: LI 04-8500_9499
preferred label: Einzelne Sprachwissenschaftler (A–Z) @de
notation: LI 05
preferred label: Methoden der Sprachwissenschaft @de
notation: LI 07
notation: LI 07-0001_1999
notation: LI 07-2000_2999
preferred label: Einzelne sprachwissenschaftliche Richtungen @de
notation: LI 07-3000_9999
preferred label: Historische Sprachwissenschaft @de
notation: LI 07-3000_3999
preferred label: Vergleichende Sprachwissenschaft @de
notation: LI 07-4000_4999
preferred label: Strukturalismus @de
notation: LI 07-5000_5499
preferred label: Generative Grammatik @de
notation: LI 07-6000_6499
preferred label: Mathematische Linguistik @de
notation: LI 07-7500_7999
preferred label: Sprachtheorie @de
notation: LI 09
notation: LI 09-0001_0499
notation: LI 09-0500_2499
notation: LI 09-2500_3499
preferred label: Geschichte der Sprachtheorie @de
notation: LI 09-3500_9999
preferred label: Allgemeines @de
notation: LI 09-3500_4499
notation: LI 09-4500_5499
notation: LI 09-5500_6499
preferred label: Renaissance und Humanismus @de
notation: LI 09-6500_6599
notation: LI 09-7500_7999
notation: LI 09-8000_8499
notation: LI 09-8500_8999
notation: LI 09-9000_9499
preferred label: Allgemeine Geschichte und Typologie der Sprachen @de
notation: LI 11
notation: LI 11-0001_1999