Systematiken für den Präsenzbestand an der Herzog August Bibliothek
type: Concept

Medizin
type: Concept
broader: Systematiken für den Präsenzbestand an der Herzog August Bibliothek
notation: Medizin @https
notation: contributor
notation: N.N.
date: 2025-04-14 @xsd
date: date
description: Präsenzbestand für das Fach Medizin. Standort: Zeughaus, 1. Obergeschoss
preferred label: Medizin im allgemeinen
notation: ME 01 @https
notation: broader
notation: type
notation: Concept
preferred label: Lexika, Wörterbücher
notation: ME 01-0001_0499 @https
preferred label: Handbücher
notation: ME 01-0500_0999 @https
preferred label: Einführungen
notation: ME 01-1000_1499 @https
preferred label: Darstellungen
notation: ME 01-1500_1999 @https
preferred label: Tabellen
notation: ME 01-2000_2499 @https
preferred label: Forschungsberichte
notation: ME 01-2500_2999 @https
preferred label: Fachadreßbücher
notation: ME 01-3000_3499 @https
preferred label: Festschriften
notation: ME 01-3500_3999 @https
preferred label: Gesammelte Abhandlungen
notation: ME 01-4000_4999 @https
preferred label: Schriftenreihen
notation: ME 01-5000_5999 @https
preferred label: Gesellschaften und Vereine
notation: ME 01-6000_6999 @https
preferred label: Institute
notation: ME 01-7000_7999 @https
preferred label: Kongresse
notation: ME 01-8000_8999 @https
preferred label: Biographische Sammelbände
notation: ME 01-9000_9999 @https
preferred label: Einzelne Fachgebiete
notation: ME 02 @https
preferred label: Anatomie
notation: ME 02-0001_0499 @https
preferred label: Physiologie
notation: ME 02-0500_0999 @https
preferred label: Pathologie
notation: ME 02-1000_1499 @https
preferred label: Diagnostik, Therapie
notation: ME 02-1500_1999 @https
preferred label: Arzneimittellehre, Apothekenwesen
notation: ME 02-2000_2499 @https
preferred label: Praktische Medizin
notation: ME 02-2500_2999 @https
preferred label: Innere Medizin
notation: ME 02-3000_3499 @https
preferred label: Chirurgie
notation: ME 02-3500_3999 @https
preferred label: Orthopädie
notation: ME 02-4000_4499 @https
preferred label: Mund­, Kiefer­, Zahnheilkunde
notation: ME 02-4500_4999 @https
preferred label: Augenheilkunde
notation: ME 02-5000_5499 @https
preferred label: Hals­, Nasen­, Ohrenheilkunde
notation: ME 02-5500_5999 @https
preferred label: Haut­ und Geschlechtskrankheiten
notation: ME 02-6000_6499 @https
preferred label: Urologie
notation: ME 02-6500_6999 @https
preferred label: Frauenheilkunde, Geburtshilfe
notation: ME 02-7000_7499 @https
preferred label: Kinderheilkunde
notation: ME 02-7500_7999 @https
preferred label: Neurologie und Psychiatrie
notation: ME 02-8000_8499 @https
preferred label: Öffentlicher Gesundheitsdienst
notation: ME 02-8500_8999 @https