Retrospektive Erschließung medizinischer, naturwissenschaftlicher, juristischer und theologischer Drucke
type: Concept
broader: Systematiken für den Präsenzbestand an der Herzog August Bibliothek
notation: MN
notation: creator
notation: Otto Hartwig
contributor: Herzog August Bibliothek Wolfenbüttel
date: 1880
description: In den 80er Jahren unternahm die Herzog August Bibliothek einen Anlauf zur retrospektiven klassifikatorischen Sacherschließung des Altbestandes. Hierbei stützte man sich auf die von Otto Hartwig (1830–1902) für die Bibliothek der Universität Halle entworfene Systematik, passte diese aber an das Wolfenbütteler Bestandsprofil an. Durchgeführt wurde die Erschließung für Medizin und Naturwissenschaften, teilweise auch für Theologie und Recht. Es entstand ein Kartenkatalog, der im Zuge des Catalogue Enrichment in elektronische Form überführt wurde.
preferred label: Chemie
broader: notation
broader: CHEM
broader: type
broader: Concept
preferred label: Allgemeines
broader: CHEM A
preferred label: Zeitschriften
broader: CHEM Aa
preferred label: Bibliographie
broader: CHEM Ab
preferred label: Geschichte
broader: CHEM Ac
preferred label: Lexika
broader: CHEM Ad
broader: example
broader: Wörterbücher
preferred label: Methode
broader: CHEM Ae
broader: Systematik; Tabellen
preferred label: Grundbegriffe [chem.]
broader: CHEM Af
broader: Verbindungen
preferred label: Lehrbücher
broader: CHEM Ag
preferred label: Gesammelte Schriften einzelner Verfasser (A-Z)
broader: CHEM Ah
preferred label: Sammelwerke mehrerer Verfasser
broader: CHEM Ai
preferred label: Quaestiones [chem.]
broader: CHEM Ak
broader: Observationes; Experimente [chem.]
preferred label: Biografische Literatur (A-Z)
alternative label: Boyle, Robert: Biographie
broader: CHEM Al
preferred label: Alchemie
alternative label: Spagyrik; Quintessenz; Essentia quinta; Medicina hermetica; Stein der Weisen; Lapis metaphysicus; Lapis philosophorum; Hermetik
broader: CHEM B
preferred label: Phlogistontheorie
broader: CHEM C
preferred label: Theoretische Chemie
broader: CHEM D
alternative label: Chemie, theoretische: Lehrbücher
broader: CHEM Da
preferred label: Affinitätslehre
broader: CHEM Db
broader: Wahlverwandtschaften
preferred label: Analytische Chemie
broader: CHEM E
alternative label: Chemie, analytische: Lehrbücher
broader: CHEM Ea
preferred label: Analysen einzelner Stoffe
broader: CHEM Eb
preferred label: Stöchiometrie
alternative label: Gewichtmessung chemischer Stoffe
broader: CHEM Ec
broader: Gewichtmessung
preferred label: Physikalische Chemie (allg.)
broader: CHEM F
preferred label: Elektrochemie
broader: CHEM Fa
preferred label: Anorganische Chemie
alternative label: Wasser; Vitriol; Tartarus; Sulphur; Selen; Sal; Phosphor; Nitrum; Mineralchemie; Kalk; Gas; Antimon; Acidum nitricum; Acidum vitrioli
broader: CHEM G
preferred label: Organische Chemie
alternative label: Urina; Tierchemie; Pflanzensäure; Pflanzenchemie; Parfümerie; Milchzucker; Milch; Kosmetik; Kampfer; Fermentation; Gärung; Ambra; Parfümeriewesen
broader: CHEM H
preferred label: Angewandte Chemie
broader: CHEM I
alternative label: Chemie, angewandte: Lehrbücher
broader: CHEM Ia

Systematiken für den Präsenzbestand an der Herzog August Bibliothek
type: Concept