Systematiken für den Präsenzbestand an der Herzog August Bibliothek
type: Concept

Naturwissenschaft und Technik
type: Concept
broader: Systematiken für den Präsenzbestand an der Herzog August Bibliothek
notation: Naturwissenschaft und Technik @https
notation: contributor
notation: N.N.
date: 2025-04-14 @xsd
date: date
description: Präsenzbestand für das Fach Naturwissenschaft und Technik. Standort: Zeughaus, 2. Obergeschoss
preferred label: Naturwissenschaften im Allgemeinen
notation: NT 01 @https
notation: broader
notation: type
notation: Concept
preferred label: Lexika
notation: NT 01-0001_0499 @https
preferred label: Handbücher
notation: NT 01-0500_0999 @https
preferred label: Einführungen
notation: NT 01-1000_1499 @https
preferred label: Darstellungen
notation: NT 01-1500_1999 @https
preferred label: Tabellen
notation: NT 01-2000_2499 @https
preferred label: Forschungsberichte
notation: NT 01-2500_2999 @https
preferred label: Fachadreßbücher
notation: NT 01-3000_3499 @https
preferred label: Festschriften
notation: NT 01-3500_3999 @https
preferred label: Gesammelte Abhandlungen
notation: NT 01-4000_4999 @https
preferred label: Schriftenreihen
notation: NT 01-5000_5999 @https
preferred label: Gesellschaften und Vereine
notation: NT 01-6000_6999 @https
preferred label: Institute
notation: NT 01-7000_7999 @https
preferred label: Kongresse
notation: NT 01-8000_8999 @https
preferred label: Biographische Sammelbände
notation: NT 01-9000_9999 @https
preferred label: Einzelne Fachgebiete
notation: NT 02 @https
preferred label: Mathematik
notation: NT 02-0001_0999 @https
preferred label: Astrophysik
notation: NT 02-1000_1999 @https
preferred label: Physik
notation: NT 02-2000_2999 @https
preferred label: Meteorologie
notation: NT 02-3000_3999 @https
preferred label: Chemie
notation: NT 02-4000_4999 @https
preferred label: Geologie, Mineralogie, Paläontologie
notation: NT 02-5000_6999 @https
preferred label: Geologie
notation: NT 02-5001_5699 @https
preferred label: Mineralogie
notation: NT 02-5800_6500 @https
preferred label: Paläontologie
notation: NT 02-6600_6900 @https
preferred label: Biologie
notation: NT 02-7000_7999 @https
preferred label: Botanik
notation: NT 02-8000_8999 @https
preferred label: Zoologie
notation: NT 02-9000_9999 @https
preferred label: Technik im Allgemeinen
notation: NT 03 @https
preferred label: Allgemein
notation: NT 03-0001_0999 @https
preferred label: Technische Erfindungen
notation: NT 03-1000_1999 @https
preferred label: Bergbau und Hüttenwesen
notation: NT 03-2000_2999 @https
preferred label: Maschinenbau, Instrumentenkunde
notation: NT 03-3000_3999 @https
preferred label: Elektrotechnik
notation: NT 03-4000_4999 @https