Systematiken für den Präsenzbestand an der Herzog August Bibliothek
type: Concept

Slawische, orientalische, ostasiatische und afrikanische Sprachen und Literaturen
type: Concept
broader: Systematiken für den Präsenzbestand an der Herzog August Bibliothek
notation: Slawische, orientalische, ostasiatische und afrikanische Sprachen und Literaturen
notation: contributor
notation: Hartmut Beyer @de
date: 2026-05-12 @xsd
date: date
description: Präsenzbestand für das Fach Slawische, orientalische, ostasiatische und afrikanische Sprachen und Literaturen. Standort: Zeughaus, Galerie im Erdgeschoss @de
preferred label: Slawistik @de
notation: OA#01
notation: broader
notation: type
notation: Concept
preferred label: Allgemeines @de
notation: OA#01-0001_4999
preferred label: Geschichte der Slawistik @de
notation: OA#01-5000_9999
preferred label: Quellensammlungen @de
notation: OA#01-5000_5499
notation: OA#01-5500_6499
preferred label: Geschichte der Slawistik in einzelnen Epochen @de
notation: OA#01-6500_8299
preferred label: Mittelalter bis 16. Jh. @de
notation: OA#01-6501_7249
preferred label: 17. Jahrhundert @de
notation: OA#01-7250_7499
preferred label: 18. Jahrhundert @de
notation: OA#01-7500_7749
preferred label: 19. Jahrhundert @de
notation: OA#01-7750_7999
preferred label: 20. Jahrhundert @de
notation: OA#01-8000_8149
preferred label: 21. Jahrhundert @de
notation: OA#01-8159_8299
preferred label: Einzelne Slawisten (A–Z) @de
notation: OA#01-8300_9998
preferred label: Slawische Sprachwissenschaft, Kirchenslawisch @de
notation: OA#02
preferred label: Slawische Sprachwissenschaft @de
notation: OA#02-0001_4999
notation: OA#02-0001_1999
preferred label: Grammatik @de
notation: OA#02-2000_2749
preferred label: Lautlehre @de
notation: OA#02-2750_2999
preferred label: Formenlehre @de
notation: OA#02-3000_3249
preferred label: Syntax @de
notation: OA#02-3250_3499
preferred label: Wortbildung @de
notation: OA#02-3500_3749
preferred label: Wortschatz @de
notation: OA#02-3750_3999
preferred label: Lexikographie @de
notation: OA#02-4000_4249
preferred label: Namenkunde @de
notation: OA#02-4250_4499
preferred label: Etymologie @de
notation: OA#02-4500_4749
preferred label: Semantik @de
notation: OA#02-4750_4999
preferred label: Kirchenslawisch @de
notation: OA#02-5000_9999
notation: OA#02-5000_6999
notation: OA#02-7000_7749
preferred label: Laut- und Formenlehre @de
notation: OA#02-7750_7999
preferred label: Syntax und Wortbildung @de
notation: OA#02-8000_8249
preferred label: Wortschatz und Lexikographie @de
notation: OA#02-8250_8499
notation: OA#02-8500_8749
preferred label: Etymologie und Semantik @de
notation: OA#02-8750_8999
preferred label: Einzelne Dialekte des Kirchenslawischen @de
notation: OA#02-9000_9999
preferred label: Slawische Literaturwissenschaft @de
notation: OA#03
notation: OA#03-0001_1999