Systematiken für den Präsenzbestand an der Herzog August Bibliothek
type: Concept

Philosophie und Psychologie
type: Concept
broader: Systematiken für den Präsenzbestand an der Herzog August Bibliothek
notation: Philosophie und Psychologie @https
notation: contributor
notation: Hartmut Beyer
date: 2026-05-22 @xsd
date: date
description: Präsenzbestand für das Fach Philosophie und Psychologie. Standort: Zeughaus, Erdgeschoss
preferred label: Philosophie allgemein
notation: PH#01 @https
notation: broader
notation: type
notation: Concept
preferred label: Allgemeine Quellensammlungen
notation: PH#01-1000_1049 @https
preferred label: Enzyklopädien, Sachwörterbücher
notation: PH#01-1050_1099 @https
preferred label: Begriffswörterbücher
notation: PH#01-1100_1199 @https
preferred label: Biographische Wörterbücher
notation: PH#01-1200_1299 @https
preferred label: Bildmaterial, Tafeln, Tabellen, Fachadressbücher
notation: PH#01-1300_1349 @https
preferred label: Handbücher
notation: PH#01-1400_1499 @https
preferred label: Einführungen in die Philosophie
notation: PH#01-1500_1649 @https
preferred label: Forschungsberichte
notation: PH#01-1650_1699 @https
preferred label: Festschriften
notation: PH#01-1700_1799 @https
preferred label: Gesellschaften und Vereine
notation: PH#01-1800_1899 @https
preferred label: Kongresse
notation: PH#01-1900_1999 @https
preferred label: Schriftenreihen
notation: PH#01-2000_4999 @https
preferred label: Geschichte der Geschichte der Philosophie
notation: PH#01-6000_6999 @https
preferred label: Allgemein
notation: PH#01-6000_6199 @https
preferred label: Antike
notation: PH#01-6200_6299 @https
preferred label: Mittelalter
notation: PH#01-6300_6399 @https
preferred label: Frühe Neuzeit
notation: PH#01-6400_6499 @https
preferred label: Moderne
notation: PH#01-6500_6699 @https
preferred label: Einzelprobleme
notation: PH#01-6700_6999 @https
preferred label: Geschichte der westlichen Philosophie
notation: PH#02 @https
preferred label: Vorgeschichte der westlichen Philosophie
notation: PH#02-0100_0199 @https
preferred label: Gesamtdarstellungen / Epochenübergreifende Regionalgeschichten der westlichen Philosophie
notation: PH#02-0300_1199 @https
preferred label: Philosophie der griechischen Antike / Philosophie der hellenistischen, römischen und christlichen Antike
notation: PH#02-1200_2999 @https
preferred label: Allgemein oder in Teilbereichen
notation: PH#02-1201_1601 @https
preferred label: Vorsokratik
notation: PH#02-1602_1649 @https
preferred label: Sophistik, Sokratik
notation: PH#02-1650_1699 @https
preferred label: Akademie, Peripatos
notation: PH#02-1700_1749 @https
preferred label: Hellenismus allgemein
notation: PH#02-1780_1819 @https
preferred label: Epikureismus
notation: PH#02-1820_1849 @https
preferred label: Stoa
notation: PH#02-1850_1899 @https
preferred label: Skepsis / Zynismus
notation: PH#02-1901_1949 @https
preferred label: Gnosis
notation: PH#02-1951_1999 @https
preferred label: Neupythagoreismus
notation: PH#02-2000_2019 @https