Systematiken für den Präsenzbestand an der Herzog August Bibliothek
type: Concept

Romanistik
type: Concept
broader: Systematiken für den Präsenzbestand an der Herzog August Bibliothek
notation: Romanistik
notation: contributor
notation: Sven Limbeck @de
date: 2025-04-14 @xsd
date: date
description: Präsenzbestand für das Fach Romanistik. Standort: Zeughaus, Galerie im Erdgeschoss @de
preferred label: Romanistik, Allgemeines [Formalschlüssel: 10000] @de
notation: RO 01
notation: broader
notation: type
notation: Concept
preferred label: Geschichte der Romanistik @de
notation: RO 02
preferred label: Quellensammlungen @de
notation: RO 02-0001_0999
preferred label: Allgemeines [Formalschlüssel; 2000] @de
notation: RO 02-1000_2999
preferred label: Geschichte der Wissenschaft in und von einzelnen Epochen @de
notation: RO 02-3000_6499
preferred label: Mittelalter @de
notation: RO 02-3000_3499
preferred label: Renaissance, Humanismus @de
notation: RO 02-3500_3999
preferred label: 16. Jahrhundert @de
notation: RO 02-4000_4499
preferred label: 17. Jahrhundert @de
notation: RO 02-4500_4999
preferred label: 18. Jahrhundert @de
notation: RO 02-5000_5499
preferred label: 19. Jahrhundert @de
notation: RO 02-5500_5999
preferred label: 20. Jahrhundert @de
notation: RO 02-6000_6499
preferred label: Einzelne Romanisten (A-Z) @de
notation: RO 02-6500_9999
preferred label: Vulgärlatein, Entstehung der romanischen Sprachen @de
notation: RO 03
notation: RO 03-0001_1999
preferred label: Allgemeines [Formalschlüssel: 4000] @de
notation: RO 03-2000_5999
preferred label: Grammatik @de
notation: RO 03-6000_6999
preferred label: Phonetik @de
notation: RO 03-7000_7499
preferred label: Morphologie @de
notation: RO 03-7500_7999
preferred label: Syntax @de
notation: RO 03-8000_8499
preferred label: Wortbildung @de
notation: RO 03-8500_8999
preferred label: Wortschatz @de
notation: RO 03-9000_9499
preferred label: Namenkunde @de
notation: RO 03-9500_9999
preferred label: Romanische Sprachwissenschaft @de
notation: RO 04
notation: RO 04-0001_3999
notation: RO 04-4000_5499
notation: RO 04-5500_5999
notation: RO 04-6000_6499
notation: RO 04-6500_6999
notation: RO 04-7000_7499
notation: RO 04-7500_7999
preferred label: Lexikographie @de
notation: RO 04-8000_8249
notation: RO 04-8250_8749
preferred label: Etymologie @de
notation: RO 04-8750_8999
preferred label: Semantik @de
notation: RO 04-9000_9249
preferred label: Stilistik und Rhetorik @de
notation: RO 04-9250_9749
preferred label: Romanische Literaturwissenschaft @de
notation: RO 05
notation: RO 05-0001_3999
preferred label: Quellenkunde @de
notation: RO 05-4000_5999