Systematiken für den Präsenzbestand an der Herzog August Bibliothek
type: Concept

Rechtswissenschaft
type: Concept
broader: Systematiken für den Präsenzbestand an der Herzog August Bibliothek
notation: Rechtswissenschaft
notation: contributor
notation: Sandra Simon @de
date: 2025-04-14 @xsd
date: date
description: Präsenzbestand für das Fach Rechtswissenschaft. Standort: Zeughaus, 2. Obergeschoss. Approval Plan @de
preferred label: Allgemeines @de
notation: RV 01
notation: broader
notation: type
notation: Concept
preferred label: Gesetzessammlungen. Gesetzblätter @de
notation: RV 01-0010_0499
preferred label: Entscheidungssammlungen @de
notation: RV 01-0500_0699
preferred label: Enzyklopädien. Sachwörterbücher. Allgemeine Nachschlagewerke. @de
notation: RV 01-0700_0899
preferred label: Sprach– und terminologische Wörterbücher @de
notation: RV 01-0900_0999
preferred label: Biographische Wörterbücher @de
notation: RV 01-1000_1099
preferred label: Bildmaterial, Tafeln, Tabellen, Statistiken @de
notation: RV 01-1100_1199
preferred label: Gutachten, Denkschriften @de
notation: RV 01-1200_1499
preferred label: Rechtsvergleichung @de
notation: RV 01-1500_1799
preferred label: Geschichte und Methodik des Fachs. Forschungsberichte @de
notation: RV 01-1800_1999
preferred label: Organisationsformen. Fachadreßbücher. Studium und Beruf @de
notation: RV 01-2000_2199
preferred label: Einführungen @de
notation: RV 01-2200_2499
preferred label: Gesammelte Abhandlungen Mehrerer (Festschriften) und Einzelner. Schriftenreihen @de
notation: RV 01-2500_2999
preferred label: Allgemeine Rechtslehre. Rechtstheorie. @de
notation: RV 01-3000_3499
preferred label: Handbücher. Gesamtdarstellungen @de
notation: RV 01-3500_3999
preferred label: Rechtswissenschaft und andere Disziplinen @de
notation: RV 01-4000_4999
preferred label: Biographien und Autobiographien einzelner Juristen [A–Z] @de
notation: RV 01-5000_5999
preferred label: Rechtsphilosophie @de
notation: RV 02
preferred label: Allgemeine Darstellungen @de
notation: RV 02-0010_0599
preferred label: Einzelne Systeme @de
notation: RV 02-0600_0999
preferred label: Darstellungen zu Einzelproblemen @de
notation: RV 02-1000_1999
preferred label: Einzelne Rechtsphilosophen [A–Z] @de
notation: RV 02-2000_2999
preferred label: Rechtssoziologie @de
notation: RV 03
notation: RV 03-0010_0399
preferred label: Einzelfragen @de
notation: RV 03-0400_0499
preferred label: Rechtspsychologie @de
notation: RV 04
notation: RV 04-0010_0399
notation: RV 04-0400_0499
preferred label: Allgemeine Rechtsgeschichte @de
notation: RV 05
preferred label: Übergeordnete Quellensammlungen @de
notation: RV 05-0010_0299
preferred label: Quellen zum antiken Recht (außer Rom) @de
notation: RV 05-0300_0499
preferred label: Quellen zum römischen Recht @de
notation: RV 05-0500_0699
preferred label: Mittelalter @de
notation: RV 05-0700_0899
preferred label: Neuzeit @de
notation: RV 05-0900_1499
preferred label: Enzyklopädien. Sachwörterbücher @de
notation: RV 05-1500_1999
notation: RV 05-2000_2999