Systematiken für den Präsenzbestand an der Herzog August Bibliothek
type: Concept

Theologie und Religionswissenschaften
type: Concept
broader: Systematiken für den Präsenzbestand an der Herzog August Bibliothek
notation: Theologie und Religionswissenschaften @https
notation: contributor
notation: Christian Heitzmann
date: 2025-05-04 @xsd
date: date
description: Präsenzbestand für das Fach Theologie und Religionswissenschaften. Standort: Augusta
preferred label: Religionswissenschaften, allg.
notation: TH 01 @https
notation: broader
notation: type
notation: Concept
preferred label: Textsammlungen
notation: TH 01-0001_0399 @https
preferred label: Wörterbücher, Enzyklopädien
notation: TH 01-0400_0999 @https
preferred label: Biographische Wörterbücher
notation: TH 01-1000_1499 @https
preferred label: Geschichte der Religionswissenschaften
notation: TH 01-1500_1999 @https
preferred label: Adressbücher, Statistiken
notation: TH 01-2000_2499 @https
preferred label: Hand- u. Lehrbücher
notation: TH 01-2500_2999 @https
preferred label: Nichtchristliche Religionen
notation: TH 01-3000_8999 @https
preferred label: Naturreligionen nach Erdteilen
notation: TH 01-3000_3999 @https
preferred label: Kulturreligionen allg.
notation: TH 01-4000_4499 @https
preferred label: Ägyptische Religionen
notation: TH 01-4500_4999 @https
preferred label: Asiatische Religionen
notation: TH 01-5000_5499 @https
preferred label: Vorderasiatische Religionen
notation: TH 01-5000_5199 @https
preferred label: Iranische Religionen
notation: TH 01-5200_5299 @https
preferred label: Indische Religionen
notation: TH 01-5300_5399 @https
preferred label: Ostasiatische Religionen
notation: TH 01-5400_5499 @https
preferred label: Islam
notation: TH 01-5500_5699 @https
preferred label: Europäische Religionen
notation: TH 01-5700_8999 @https
preferred label: Griechische Religion
notation: TH 01-5700_5799 @https
preferred label: Römische Religion
notation: TH 01-5800_5899 @https
preferred label: Jüdische Religion
notation: TH 01-7000_7999 @https
preferred label: Judaistik, allg.
notation: TH 01-7000_7199 @https
preferred label: Geschichte des Judentums
notation: TH 01-7200_7299 @https
preferred label: Jüdisches Schrifttum
notation: TH 01-7300_7399 @https
preferred label: Sprachen des Judentums
notation: TH 01-7400_7499 @https
preferred label: Jüdische Traditionen
notation: TH 01-7500_7599 @https
preferred label: Jüdisches Recht
notation: TH 01-7600_7699 @https
preferred label: Jüdischer Gottesdienst
notation: TH 01-7700_7799 @https
preferred label: Verhältnis zu ander. Religionen
notation: TH 01-7800_7899 @https
preferred label: sonstige europäische Religionen
notation: TH 01-8000_8999 @https
preferred label: Vergleichende Religionswissenschaften
notation: TH 01-9000_9999 @https
preferred label: Theologie, allg.
notation: TH 02 @https
preferred label: Einführungen
notation: TH 02-0001_1399 @https
preferred label: Enzyklopädien, Sachwörterbücher
notation: TH 02-1400_1999 @https