Systematiken für den Präsenzbestand an der Herzog August Bibliothek
type: Concept

Theaterwissenschaften
type: Concept
broader: Systematiken für den Präsenzbestand an der Herzog August Bibliothek
notation: Theaterwissenschaften @https
notation: contributor
date: 2013-01-01 @xsd
date: date
description: Präsenzbestand für das Fach Theaterwissenschaften. Standort: Zeughaus, Erdgeschoss
preferred label: Das Fach als Ganzes
notation: TW 01 @https
notation: broader
notation: type
notation: Concept
preferred label: Enzyklopädien / Lexika (Personen und Sachen), Handbücher, Einführungen, umfassende Bildwerke
notation: TW 01-0001_2000 @https
preferred label: Sachlexika, Wörterbücher
notation: TW 01-2001_3000 @https
preferred label: Personenlexika
notation: TW 01-3001_6000 @https
preferred label: Gesamtdarstellungen, Übersichten, Tabellen- und Abbildungswerke
notation: TW 01-6001_8000 @https
preferred label: Fest- u. a. Schriften (zu einzelnen Personen), Kongreß- und Tagungsberichte
notation: TW 02 @https
preferred label: Gesammelte Schriften einzelner Autoren
notation: TW 02-0001_2000 @https
preferred label: Sammelschriften zu Ehren Einzelner
notation: TW 02-2001_6000 @https
preferred label: Kongreß- und Tagungsberichte u. ä.
notation: TW 02-6001_9000 @https
preferred label: Schriftenreihen mit übergreifender Thematik
notation: TW 02-9001_9500 @https
preferred label: Kataloge, Publikationswesen, fachbibliothekarische Arbeit
notation: TW 03 @https
preferred label: Zentrale bzw. mehrere Bestände erfassende Verzeichnisse
notation: TW 03-0001_2000 @https
preferred label: Bestands- und Ausstellungskataloge einzelner Institutionen (Sammlungen, Museen, Bibliotheken usw.)
notation: TW 03-2001_7000 @https
preferred label: Publikationswesen der Theaterwissenschaft
notation: TW 03-7001_8000 @https
preferred label: Theaterbibliothekarische Arbeit
notation: TW 03-8001_8500 @https
preferred label: Kataloge von Sekundärliteratur
notation: TW 03-8501_9000 @https
preferred label: Adressenverzeichnisse von Sammlungen, einschlägigen Institutionen und Vereinigungen
notation: TW 03-9001_9500 @https
preferred label: Systematische Teilfächer und größere Sachgebiete
notation: TW 04 @https
preferred label: Philosophie und Ästhetik des Theaters
notation: TW 04-0001_2000 @https
preferred label: Theater-Soziologie
notation: TW 04-2001_4000 @https
preferred label: Theaterkritik
notation: TW 04-4001_7000 @https
preferred label: Grundsätzliches und größere Themenkomplexe
notation: TW 04-4001_6000 @https
preferred label: Editionen bzw. Sammlungen von Kritiken
notation: TW 04-6001_7000 @https
preferred label: Zensur
notation: TW 04-7001_8000 @https
preferred label: Theaterpädagogik
notation: TW 04-8001_9000 @https
preferred label: Schauspielkunst, Schauspielerausbildung, künstlerisches und wissenschaftliches Studium, Lehre und Forschung
notation: TW 05 @https
preferred label: Zur Schauspielkunst, Grundsätzliches und in der Geschichte
notation: TW 05-0001_5000 @https
preferred label: Ausbildung und Berufsvorbereitung der Schauspieler / innen
notation: TW 05-5001_6500 @https
preferred label: Hochschulstudium für Theaterberufe
notation: TW 05-6501_7500 @https
preferred label: Studium, Lehre und Forschung der Theaterwissenschaft
notation: TW 05-7501_9500 @https
preferred label: Das Theater als Organismus, Institution, Organisation und Betrieb
notation: TW 06 @https
preferred label: Theater als Ganzes
notation: TW 06-0001_0200 @https
preferred label: Intendanz und Dramaturgie, Spielplangestaltung und Repertoirefragen, Theaterverwaltung und Personal
notation: TW 06-0201_1000 @https
preferred label: Inszenierung und Regie / Spielleitung (einschl. Studienleiter und Inspizienten, Dirigenten, Balletdirektoren und Choreografen), Soufflieren
notation: TW 06-1001_3000 @https
preferred label: Ensemble-Fragen (Ensemble als Ganzes, Schauspiel, Ballettsolisten und --korps, Orchester, Solo- und Chorsänger)