Systematiken für den Präsenzbestand an der Herzog August Bibliothek
type: Concept

Wissenschafts- und Bildungsgeschichte
type: Concept
broader: Systematiken für den Präsenzbestand an der Herzog August Bibliothek
notation: Wissenschafts- und Bildungsgeschichte
notation: contributor
notation: N.N. @de
date: 2025-04-14 @xsd
date: date
description: Präsenzbestand für das Fach Wissenschafts- und Bildungsgeschichte. Standort: Zeughaus, 2. Obergeschoss @de
preferred label: Wissenschaftskunde: Allgemeines @de
notation: WB 01
notation: broader
notation: type
notation: Concept
preferred label: Enzyklopädien, Sammelwerke @de
notation: WB 01-0001_0499
preferred label: Biographische Wörterbücher @de
notation: WB 01-0500_0999
preferred label: Handbücher @de
notation: WB 01-1000_1499
preferred label: Einführungen @de
notation: WB 01-1500_1999
preferred label: Darstellungen @de
notation: WB 01-2000_3999
preferred label: Forschungsberichte @de
notation: WB 01-4000_4499
preferred label: Tafeln etc. @de
notation: WB 01-4500_4999
preferred label: Gesammelte Abhandlungen @de
notation: WB 01-5000_5999
preferred label: Schriftenreihen @de
notation: WB 01-6000_6499
preferred label: Gesellschaften, Institute @de
notation: WB 01-6500_6999
preferred label: Kongresse @de
notation: WB 01-7000_7499
preferred label: Begriffe der Wissenschaft @de
notation: WB 02
preferred label: Allgemeines @de
notation: WB 02-0001_1999
preferred label: Wissenschaft als Beruf @de
notation: WB 02-2000_4999
preferred label: Verhältnis von Geistes­ und Naturwissenschaften @de
notation: WB 02-5000_5999
preferred label: Einzelne Fragen @de
notation: WB 02-6000_6999
preferred label: Wissenschaftstheorie @de
notation: WB 03
notation: WB 03-0001_1999
preferred label: Analytische und deduktive Wissenschaftstheorie @de
notation: WB 03-2000_3999
preferred label: Dialektische Wissenschaftstheorie @de
notation: WB 03-4000_4999
preferred label: Hermeneutik @de
notation: WB 03-5000_5999
preferred label: Wert und Kritik der Wissenschaften @de
notation: WB 03-6000_6999
preferred label: Wissenschaftssystematik @de
notation: WB 04
notation: WB 04-0001_1999
preferred label: Systematik und Klassifikation @de
notation: WB 04-2000_2999
preferred label: Logik der Wissenschaft @de
notation: WB 04-3000_3999
preferred label: Wissenschaftliche Methoden @de
notation: WB 05
notation: WB 05-0001_1999
preferred label: Methoden in den Geisteswissenschaften @de
notation: WB 05-2000_2999
preferred label: Methoden in den Naturwissenschaften @de
notation: WB 05-3000_3999
preferred label: Methoden in den Sozialwissenschaften @de
notation: WB 05-4000_4999
preferred label: Methoden in den angewandten Wissenschaften @de
notation: WB 05-5000_5999
preferred label: Wissenschaftsordnung @de
notation: WB 06
notation: WB 06-0001_0999
preferred label: Wissenschaftspsychologie @de
notation: WB 06-1000_1999