Systematiken für den Präsenzbestand an der Herzog August Bibliothek
type: Concept

Wirtschafts- und Sozialgeschichte
type: Concept
broader: Systematiken für den Präsenzbestand an der Herzog August Bibliothek
notation: Wirtschafts- und Sozialgeschichte @https
notation: contributor
notation: N.N.
date: 2025-04-14 @xsd
date: date
description: Präsenzbestand für das Fach Wirtschafts- und Sozialgeschichte. Standort: Zeughaus, Erdgeschoss. Klassen 1–25 und 50 ist das Fachreferat Politikwissenschaft zuständig, s. PT
preferred label: Politologie: Allgemeines zum gesamten Fach
notation: WS 01 @https
notation: broader
notation: type
notation: Concept
preferred label: Umfassende Quellensammlungen
notation: WS 01-0100_0199 @https
preferred label: Quelleneditionen zu Einzelfällen
notation: WS 01-0200_0299 @https
preferred label: Einführungen
notation: WS 01-0300_0329 @https
preferred label: Enzyklopädien, Sachwörterbücher
notation: WS 01-0330_0399 @https
preferred label: Grundbegriffe, Sprach­ und terminologische Wörterbücher
notation: WS 01-0400_0449 @https
preferred label: Biographische Wörterbücher
notation: WS 01-0450_0499 @https
preferred label: Bildmaterial, Tafeln, Tabellen und Statistiken
notation: WS 01-0500_0549 @https
preferred label: Geschichte und Methodik, Forschungsberichte
notation: WS 01-0550_0649 @https
preferred label: Institutionen, Adreßbücher
notation: WS 01-0650_0699 @https
preferred label: Gesammelte Abhandlungen mehrerer (Festschriften) und einzelner Schriftenreihen (A–Z; Einzelausgaben zu den ges. Werken)
notation: WS 01-0700_0999 @https
preferred label: Handbücher, Darstellungen zur gesamten Politologie
notation: WS 01-1000_1999 @https
preferred label: Maßstäbe politischer Entscheidungen
notation: WS 01-2000_2999 @https
preferred label: Politische Bildung
notation: WS 01-3000_3999 @https
preferred label: Politik und andere Wissenschaften
notation: WS 01-4000_4999 @https
preferred label: Verbindung zu Philosophie
notation: WS 01-4100_4199 @https
preferred label: Verbindung zu Wirtschaft und Soziologie
notation: WS 01-4200_4299 @https
preferred label: Verbindung zu Geschichte
notation: WS 01-4300_4399 @https
preferred label: Verbindung zu Geographie
notation: WS 01-4400_4499 @https
preferred label: Geschichte der politischen Philosophie
notation: WS 04 @https
preferred label: Gesamtdarstellungen und allgemeine Abhandlungen
notation: WS 04-0010_0199 @https
preferred label: Darstellungen zu Einzelproblemen
notation: WS 04-0200_0999 @https
preferred label: Mittelalter
notation: WS 04-1000_2999 @https
preferred label: Augustinus
notation: WS 04-1100_1199 @https
preferred label: Scholastik
notation: WS 04-1200_1299 @https
preferred label: Thomas von Aquin
notation: WS 04-1300_1399 @https
preferred label: Johannes von Salisbury
notation: WS 04-1400_1499 @https
preferred label: Averroes
notation: WS 04-1500_1599 @https
preferred label: Dante Alighieri
notation: WS 04-1600_1699 @https
preferred label: Marsilius von Padua
notation: WS 04-1700_1799 @https
preferred label: William Ockham
notation: WS 04-1800_1899 @https
preferred label: Neuzeit I (1500–1700): Renaissance und Humanismus
notation: WS 04-3000_4499 @https
preferred label: Allgemeine Darstellungen
notation: WS 04-3010_3149 @https
preferred label: Thomas Morus
notation: WS 04-3150_3199 @https